{"text_format":"1","workbook":"xlsx","n_sheets":3,"sheets":["Collateral Tables","Note Balances","Cumulative Defaults"],"not_rendered":{"charts":1,"images":0,"macros":1,"external_links":9,"defined_names":24,"comments":1,"pivot_tables":0},"unopened":[],"bounds":{"document_bytes":16777216,"sheet_cells":100000,"rows_first":2000,"rows_last":500,"rows_between":2000,"halvings":0,"cell_chars":16384,"cell_head_chars":4096},"cells_cut":0,"cells_raw":0,"read":"whole","date_system":"1900"}

{"sheet":"Collateral Tables","index":0,"n_rows":248,"n_cols":15,"rows_kept":248,"cut":false,"hidden":false,"merged":[]}
[null,"CNH CAPITAL AUSTRALIA RECEIVABLES TRUST SERIES 2013-1 (TERM DEAL)"]
[null,"COLLATERAL DATA TABLES"]
[]
[null,"OUTSTANDING RECEIVABLES",null,null,"2014-03-31",null,null,null,"2013-12-31",null,null,null,"2013-09-30"]
[]
[null,"Opening Balance",null,null,{"$f":"I13","v":343183216.40999991},null,null,null,367572501.20999992,null,null,null,399999996.31]
[null,"Principal Repayments - Scheduled",null,null,{"$f":"[4]Sheet1!$B$2+[5]Sheet1!$B$2+[6]Sheet1!$B$2","v":62541048.239999987},null,null,null,19784632.49000001,null,null,null,28316894.299999997]
[null,"Principal Repayments - Unscheduled",null,null,{"$f":"MAX('[3]16 Apr 14'!$H23-'Collateral Tables'!E7,0)","v":2187328.1800000817},null,null,null,4506158.3999999613,null,null,null,3783540.9800000787]
[{"$f":"SUM(M9,I9,E9)","v":1412940.09},"Charge-Offs",null,null,{"$f":"'[3]16 Apr 14'!$H37","v":987386.3600000001},null,null,null,98493.91,null,null,null,327059.82]
[null,"Reinstatements"]
[null,"New Receivables Purchased"]
[null,"Non Cash Change in Receivables"]
[null,"Closing Balance",null,null,{"$f":"E6-E7-E8-E9+E10+E11-E12","v":277467453.62999982},null,null,null,343183216.40999991,null,null,null,367572501.20999992]
[]
[null,"PORTFOLIO STATISTICS"]
[]
[null,"Summary"]
[null,"Number of contracts",null,null,{"$f":"'[7]Servicer Recon'!$B$4","v":4163},null,null,null,4387,null,null,null,4617]
[null,"Dollar value of contracts",null,null,{"$f":"'[7]Servicer Recon'!$B$5","v":277467453.63000029},null,null,null,343183216.41000015,null,null,null,367572501.21000028]
[null,"Number of contracts closed during the Quarter",null,null,{"$f":"'[7]Servicer Recon'!$B$19","v":221},null,null,null,228,null,null,null,183]
[null,"Dollar value of contracts closed during the Quarter",null,null,{"$f":"'[7]Servicer Recon'!$B$20","v":10700990.200000003},null,null,null,9069702.0300000031,null,null,null,8446613.110000005]
[]
[{"$f":"SUM(M23,I23,E23)","v":113967.13363636364},"Dollar Value of Recoveries from Collateral",null,null,{"$f":"MAX('[7]Servicer Recon'!$C$16,0)","v":19020.849999999999},null,null,null,94500,null,null,null,446.28363636364156]
[null,"Dollar Value of Recoveries from Other Sources",null,null,0,null,null,null,0,null,null,null,0]
[]
[null,"Average Term of Contracts (Months)",null,null,{"$f":"'[8]Revised Base Table'!$W$4167","v":52.232977773264125},null,null,null,51.719252312429639,null,null,null,51.33729628389451]
[null,"Average Term to Maturity (Months)",null,null,{"$f":"'[8]Revised Base Table'!$X$4167","v":29.553464471601743},null,null,null,31.625494308828717,null,null,null,33.937634820954983]
[null,"Average Residual / Balloon Payment *",null,null,{"$f":"'[8]Revised Base Table'!$AI$4167","v":2.9672797460436096E-2},null,null,null,2.8756254370488909E-2,null,null,null,3.0683073715412873E-2]
[null,"Average Seasoning (Months)",null,null,{"$f":"E26-E27","v":22.679513301662382},null,null,null,20.093758003600922,null,null,null,17.399661462939527]
[null,"Average Dollar Value of Individual Assets",null,null,{"$f":"E19/E18","v":66650.841611818469},null,null,null,78227.311695919794,null,null,null,79612.844100065035]
[null,"Weighted Average Interest Rate",null,null,{"$f":"'[8]Revised Base Table'!$AA$4167","v":5.649380812347129},null,null,null,5.6768052315365471,null,null,null,5.7023006689852697E-2]
[]
[null,"Payment in Arrears"]
["1. 0 - 30 Days","0 - 30 Days",null,null,{"$f":"IFERROR(VLOOKUP($A34,[9]Arrears!$A:$D,3,FALSE),0)","v":4144},{"$f":"IFERROR(VLOOKUP($A34,[9]Arrears!$A:$D,2,FALSE),0)","v":1000907.0400000002},{"$f":"F34/F$50","v":3.6072952950175503E-3},null,4375,439735.71,1.2813438681530656E-3,null,4592,151245.59999999998,4.1147147706131298E-4]
["2. 31 - 60 Days","31 - 60 Days",null,null,{"$f":"IFERROR(VLOOKUP($A35,[9]Arrears!$A:$D,3,FALSE),0)","v":14},{"$f":"IFERROR(VLOOKUP($A35,[9]Arrears!$A:$D,2,FALSE),0)","v":244533.99000000008},{"$f":"F35/F$50","v":8.8130693096021072E-4},null,7,47270.050000000017,1.3773998185134619E-4,null,12,113514.01999999996,3.0882076223419006E-4]
["3. 61 - 90 Days","61 - 90 Days",null,null,{"$f":"IFERROR(VLOOKUP($A36,[9]Arrears!$A:$D,3,FALSE),0)","v":3},{"$f":"IFERROR(VLOOKUP($A36,[9]Arrears!$A:$D,2,FALSE),0)","v":32291.389999999992},1.163790187913722E-4,null,5,79546.5,2.3179018144338975E-4,null,6,75092.269999999975,2.0429240422721002E-4]
["4. 91 - 120 Days","91 - 120 Days",null,null,{"$f":"IFERROR(VLOOKUP($A37,[9]Arrears!$A:$D,3,FALSE),0)","v":1},{"$f":"IFERROR(VLOOKUP($A37,[9]Arrears!$A:$D,2,FALSE),0)","v":8490.2099999999991},3.0598940124060822E-5,null,0,0,0,null,4,69228.5,1.8833971467427225E-4]
["5. 121 - 150 Days","121 - 150 Days",null,null,{"$f":"IFERROR(VLOOKUP($A38,[9]Arrears!$A:$D,3,FALSE),0)","v":0},{"$f":"IFERROR(VLOOKUP($A38,[9]Arrears!$A:$D,2,FALSE),0)","v":0},0,null,0,0,0,null,3,96751.01999999999,2.6321615376968745E-4]
["6. 151 - 180 Days","151 - 180 Days",null,null,{"$f":"IFERROR(VLOOKUP($A39,[9]Arrears!$A:$D,3,FALSE),0)","v":1},{"$f":"IFERROR(VLOOKUP($A39,[9]Arrears!$A:$D,2,FALSE),0)","v":35526.209999999977},1.2803739514391402E-4,null,0,0,0,null,0,0,0]
[null,"Total",null,null,{"$f":"SUM(E34:E39)","v":4163},{"$f":"SUM(F34:F39)","v":1321748.8400000001},{"$f":"SUM(G34:G39)","v":4.7636175800371081E-3},null,4387,566552.26,1.6508740314478015E-3,null,4617,505831.40999999992,1.3761405119666727E-3]
[null,"* Expressed as a % of Aggreg. Rec. closing bal.",null,null,null,"> 30 days",{"$f":"SUM(G35:G39)","v":1.1563222850195576E-3},null,null,"> 30 days",3.6953016329473594E-4,null,null,"> 30 days",9.6466903490535977E-4]
[]
[" 0 - 30 Days","Account Balances in Arrears"]
["1. 0 - 30 Days","0 - 30 Days",null,null,{"$f":"IFERROR(VLOOKUP($A44,[9]Arrears!$A:$D,3,FALSE),0)","v":4144},{"$f":"IFERROR(VLOOKUP($A44,[9]Arrears!$A:$D,4,FALSE),0)","v":276040244.91000026},{"$f":"F44/F$50","v":0.99485630223895327},null,4375,342575641.11000001,0.99822958912048265,null,4592,366297114.92000002,0.99653024563643466]
["2. 31 - 60 Days","31 - 60 Days",null,null,{"$f":"IFERROR(VLOOKUP($A45,[9]Arrears!$A:$D,3,FALSE),0)","v":14},{"$f":"IFERROR(VLOOKUP($A45,[9]Arrears!$A:$D,4,FALSE),0)","v":805069.69},{"$f":"F45/F$50","v":2.9014923352904355E-3},null,7,207562.01,6.0481398878209195E-4,null,12,447641.17,1.2178309545094492E-3]
["3. 61 - 90 Days","61 - 90 Days",null,null,{"$f":"IFERROR(VLOOKUP($A46,[9]Arrears!$A:$D,3,FALSE),0)","v":3},{"$f":"IFERROR(VLOOKUP($A46,[9]Arrears!$A:$D,4,FALSE),0)","v":415013.80000000005},1.4957206496492967E-3,null,5,400013.29000000004,1.1655968907351964E-3,null,6,318477.56,8.6643467330013539E-4]
["4. 91 - 120 Days","91 - 120 Days",null,null,{"$f":"IFERROR(VLOOKUP($A47,[9]Arrears!$A:$D,3,FALSE),0)","v":1},{"$f":"IFERROR(VLOOKUP($A47,[9]Arrears!$A:$D,4,FALSE),0)","v":174400.78},6.285449976866891E-4,null,0,0,0,null,4,167153.97,4.547510204102626E-4]
["5. 121 - 150 Days","121 - 150 Days",null,null,{"$f":"IFERROR(VLOOKUP($A48,[9]Arrears!$A:$D,3,FALSE),0)","v":0},{"$f":"IFERROR(VLOOKUP($A48,[9]Arrears!$A:$D,4,FALSE),0)","v":0},0,null,0,0,0,null,3,342113.59,9.3073771534542802E-4]
["6. 151 - 180 Days","151 - 180 Days",null,null,{"$f":"IFERROR(VLOOKUP($A49,[9]Arrears!$A:$D,3,FALSE),0)","v":1},{"$f":"IFERROR(VLOOKUP($A49,[9]Arrears!$A:$D,4,FALSE),0)","v":32724.449999999983},1.1793977842041853E-4,null,0,0,0,null,0,0,0]
[null,"Total",null,null,{"$f":"SUM(E44:E49)","v":4163},{"$f":"SUM(F44:F49)","v":277467453.63000023},{"$f":"SUM(G44:G49)","v":1.0000000000000002},null,4387,343183216.41000003,0.99999999999999989,null,4617,367572501.21000004,1]
["NSW",null,null,null,null,"> 30 days",{"$f":"SUM(G45:G49)","v":5.1436977610468402E-3},null,null,"> 30 days",1.7704108795172885E-3,null,null,"> 30 days",3.4697543635652753E-3]
[null,null,null,null,null,">90 days",{"$f":"SUM(G47:G49)","v":7.4648477610710768E-4},null,null,">90 days",0,null,null,">90 days",1.3854887357556906E-3]
[]
["VIC","Geographic Distribution"]
["NSW","New South Wales",null,null,{"$f":"F55/F$63","v":0.31785757427106126},{"$f":"IFERROR(VLOOKUP($A55,[9]Geographic!$A:$C,3,FALSE),0)","v":88195131.749999925},null,null,0.30462584249779701,104542476.42999999,null,null,0.30594728550096595,112457808.97]
["VIC","Victoria",null,null,0.17961117463692206,{"$f":"IFERROR(VLOOKUP($A56,[9]Geographic!$A:$C,3,FALSE),0)","v":49836255.269999981},null,null,0.17346335124640827,59529710.80999995,null,null,0.17560707835193193,64548333.020000048]
["QLD","Queensland",null,null,0.11696645839146819,{"$f":"IFERROR(VLOOKUP($A57,[9]Geographic!$A:$C,3,FALSE),0)","v":32454385.370000008},null,null,0.10914968331449117,37458339.389999971,null,null,0.11503991220997688,42285508.270000011]
["SA","South Australia",null,null,0.18971966942903601,{"$f":"IFERROR(VLOOKUP($A58,[9]Geographic!$A:$C,3,FALSE),0)","v":52641033.579999954},null,null,0.20273041431863192,69573675.649999991,null,null,0.19643661234807192,72204696.929999948]
["NT","Northern Territory",null,null,1.7710440398364222E-3,{"$f":"IFERROR(VLOOKUP($A59,[9]Geographic!$A:$C,3,FALSE),0)","v":491407.08000000013},null,null,1.6685589872084282E-3,572621.44000000018,null,null,1.6681469859185394E-3,613164.96000000008]
["ACT","Australian Capital Territory",null,null,8.2742562054195941E-4,{"$f":"IFERROR(VLOOKUP($A60,[9]Geographic!$A:$C,3,FALSE),0)","v":229583.68},null,null,7.7193157279436457E-4,264913.95999999996,null,null,8.1428923277641842E-4,299310.32999999996]
["TAS","Tasmania",null,null,1.1851378916624257E-2,{"$f":"IFERROR(VLOOKUP($A61,[9]Geographic!$A:$C,3,FALSE),0)","v":3288371.9299999992},null,null,1.0762703807715622E-2,3693579.3099999996,null,null,1.1006060019948898E-2,4045525.0099999984]
["WA","Western Australia",null,null,0.18139527469450978,{"$f":"IFERROR(VLOOKUP($A62,[9]Geographic!$A:$C,3,FALSE),0)","v":50331284.969999984},null,null,0.19682751425495335,67547899.419999987,null,null,0.19348061535040967,71118153.719999984]
[null,"Total",null,null,{"$f":"SUM(E55:E62)","v":0.99999999999999978},{"$f":"SUM(F55:F62)","v":277467453.62999988},null,null,1,343183216.40999985,null,null,1.0000000000000002,367572501.20999992]
["AG"]
["CE","Top Industry Distribution"]
["AGRICULTURAL MACHINERY","Agricultural",null,null,{"$f":"F66/F$69","v":0.97714670950757454},{"$f":"IFERROR(VLOOKUP($A66,'[9]Top Industry'!$A:$C,3,FALSE),)","v":271126409.31000036},null,null,0.97916386563188684,336032604.80000001,null,null,0.97644352275674418,358913787.94999999]
["CONSTRUCTION EQUIPMENT","Construction",null,null,{"$f":"F67/F$69","v":2.2853290492425495E-2},{"$f":"IFERROR(VLOOKUP($A67,'[9]Top Industry'!$A:$C,3,FALSE),)","v":6341044.3199999984},null,null,2.0836134368113105E-2,7150611.6099999985,null,null,2.3556477243255856E-2,8658713.2599999998]
["MOTOR VEHICLE - AG","Motor Vehicle AG",null,null,{"$f":"F68/F$69","v":0},{"$f":"IFERROR(VLOOKUP($A68,'[9]Top Industry'!$A:$C,3,FALSE),)","v":0},null,null,0,0,null,null,0,0]
[null,"Total",null,null,{"$f":"SUM(E66:E68)","v":1},{"$f":"SUM(F66:F68)","v":277467453.63000035},null,null,1,343183216.41000003,null,null,1,367572501.20999998]
["COMBINE"]
["40-100 HP TRACTOR","Collateral Types"]
["100<140 HP TRACTOR","100-140 HP TRACTOR",null,null,{"$f":"IFERROR(F72/F$108,0)","v":9.4558248135965278E-2},{"$f":"IFERROR(VLOOKUP($A72,[9]Collateral!$A:$C,3,FALSE),\"\")","v":26236836.330000002},null,null,{"$f":"J72/$J$108","v":8.7613314265574477E-2},30067418.989999987,null,null,8.9918451612853542E-2,33059288.450000003]
["4 EWD Tractors","4 EWD Tractors",null,null,0.12741599022688957,{"$f":"IFERROR(VLOOKUP($A73,[9]Collateral!$A:$C,3,FALSE),\"\")","v":35353790.360000044},null,null,{"$f":"J73/$J$108","v":0.12456718815446809},42749368.290000014,null,null,0.1233070393158724,45334888.530000031]
["40<100 HP Tractor","40<100 HP Tractor",null,null,{"$f":"IFERROR(F74/F$108,0)","v":0},{"$f":"IFERROR(VLOOKUP($A74,[9]Collateral!$A:$C,3,FALSE),\"\")","v":""},null,null,0,"",null,null,0,""]
["40<60 HP TRACTOR","40-60 HP TRACTOR",null,null,{"$f":"IFERROR(F75/F$108,0)","v":1.016631036576107E-2},{"$f":"IFERROR(VLOOKUP($A75,[9]Collateral!$A:$C,3,FALSE),\"\")","v":2820820.2500000005},null,null,9.5101854459596416E-3,3263736.0300000003,null,null,1.0298926695894554E-2,3786488.56]
["4WD VEHICLE","4WD VEHICLE",null,null,1.4758008358920752E-4,{"$f":"IFERROR(VLOOKUP($A76,[9]Collateral!$A:$C,3,FALSE),\"\")","v":40948.67},null,null,1.3383367193903851E-4,45929.47,null,null,1.2765896157056084E-4,46934.91]
["60<100 HP TRACTOR","60-100 HP TRACTOR",null,null,6.6170983190278115E-2,{"$f":"IFERROR(VLOOKUP($A77,[9]Collateral!$A:$C,3,FALSE),\"\")","v":18360294.21000002},null,null,6.2176957962033423E-2,21338088.419999991,null,null,6.6011998063524785E-2,24269876.16]
["Backhoes","Backhoes",null,null,8.8189799127324695E-4,{"$f":"IFERROR(VLOOKUP($A78,[9]Collateral!$A:$C,3,FALSE),\"\")","v":244697.99},null,null,8.2326065637913684E-4,282529.24,null,null,8.6852040077186568E-4,319318.95999999996]
["BALERS, WINDROWERS, MOWERS, RAKES","BALERS, WINDROWERS, MOWERS, RAKES",null,null,3.7631061889959468E-2,{"$f":"IFERROR(VLOOKUP($A79,[9]Collateral!$A:$C,3,FALSE),\"\")","v":10441394.919999998},null,null,3.604383276489264E-2,12369638.460000001,null,null,3.9300310659156019E-2,14449095.630000001]
["Cane Harvesters","Cane Harvesters",null,null,0,{"$f":"IFERROR(VLOOKUP($A80,[9]Collateral!$A:$C,3,FALSE),\"\")","v":""},null,null,0,"",null,null,0,""]
{"$rows_left_out":169}
{"sheet":"Note Balances","index":1,"n_rows":42,"n_cols":9,"rows_kept":42,"cut":false,"hidden":false,"merged":[]}
[null,null,"TOTAL NOTE BALANCES"]
[null,null,null,"Total Notes","Class A1 Notes","Class A2 Notes","Class B Notes","Class C Notes","Seller Notes"]
[null,null,"Initial Invested Amount",400000000,100000000,244800000,13600000,12000000,29600000]
["(a)",null,"Invested Amount as at Previous Payment Date:  16 October 2013",367899561.02999997,67899561.030000001,244800000,13600000,12000000,29600000]
["(b)",null,"Stated Amount as at Previous Payment Date:  16 October 2013",367572501.20999998,67899561.030000001,244800000,13600000,12000000,29272940.18]
["(d)",null,"Principal Payments to Noteholders on Payment Date",24290790.890000001,24290790.890000001,0,0,0,0]
[null,null,"Gross Aggregate Charge-Offs",0,0,0,0,0,0]
[null,null,"Gross Aggregate Reinstatements of charge-offs",0,0,0,0,0,0]
["(e)",null,"Aggregate Charge-Offs for this Collection Period",98493.91,0,0,0,0,98493.91]
["(f)",null,"Reinstatements relating to Charge-offs that have occurred this Collection Period",0,0,0,0,0,0]
[null,null,"Aggregate Carry Over Charge-offs not previously reinstated",0,0,0,0,0,0]
[null,null,"Reinstatements of Carry Over Charge-offs not previously reinstated",0,0,0,0,0,0]
[null,null,"Aggregate Charge-Offs not reinstated and to be carried over to next period",98493.91,0,0,0,0,98493.91]
[null,null,"Invested Amount as at Payment Date:  16 January 2014",343608770.13999999,43608770.140000001,244800000,13600000,12000000,29600000]
[null,null,"Stated Amount as at Payment Date:  16 January 2014",343183216.40999997,43608770.140000001,244800000,13600000,12000000,29174446.27]
[null,null,"Bond Factor at Payment Date:  16 January 2014",null,0.43608770140000003,1,1,1,0.98562318479729727]
[null,null,"Coupon Margin",null,4.4999999999999997E-3,1.0999999999999999E-2,1.7500000000000002E-2,2.5000000000000001E-2,0.01]
[null,null,"Coupon Rate (3 month BBSW + margin)",null,3.0450000000000001E-2,3.6949999999999997E-2,4.3450000000000003E-2,5.0950000000000002E-2,3.5950000000000003E-2]
[null,null,"Days in Coupon Period",null,92,92,92,92,92]
[null,null,"Coupon Entitlement to be paid out on the current Payment Date: 16 January 2014",null,521133.78,2279926.36,148944.22,154106.29999999999,265252.94]
[]
[]
[null,null,"TOTAL NOTE BALANCES"]
[null,null,null,"Total Notes","Class A1 Notes","Class A2 Notes","Class B Notes","Class C Notes","Seller Notes"]
[null,null,"Initial Invested Amount",400000000,100000000,244800000,13600000,12000000,29600000]
["(a)",null,"Invested Amount as at Previous Payment Date:  16 January 2014",343608770.13999999,43608770.140000001,244800000,13600000,12000000,29600000]
["(b)",null,"Stated Amount as at Previous Payment Date:  16 January 2014",343183216.40999997,43608770.140000001,244800000,13600000,12000000,29174446.27]
["(d)",null,"Principal Payments to Noteholders on Payment Date",64728376.420000002,43608770.140000001,21119606.280000001,0,0,0]
[null,null,"Gross Aggregate Charge-Offs",425553.73,0,0,0,0,425553.73]
[null,null,"Gross Aggregate Reinstatements of charge-offs",0,0,0,0,0,0]
["(e)",null,"Aggregate Charge-Offs for this Collection Period",987386.3600000001,0,0,0,0,987386.3600000001]
["(f)",null,"Reinstatements relating to Charge-offs that have occurred this Collection Period",0,0,0,0,0,0]
[null,null,"Aggregate Carry Over Charge-offs not previously reinstated",425553.73,0,0,0,0,425553.73]
[null,null,"Reinstatements of Carry Over Charge-offs not previously reinstated",0,0,0,0,0,0]
[null,null,"Aggregate Charge-Offs not reinstated and to be carried over to next period",1412940.09,0,0,0,0,1412940.09]
[null,null,"Invested Amount as at Payment Date:  16 April 2014",278880393.72000003,0,223680393.72,13600000,12000000,29600000]
[null,null,"Stated Amount as at Payment Date:  16 April 2014",277467453.63,0,223680393.72,13600000,12000000,28187059.91]
[null,null,"Bond Factor at Payment Date:  16 April 2014",null,0,0.91372709852941181,1,1,0.95226553749999998]
[null,null,"Coupon Margin",null,4.4999999999999997E-3,1.0999999999999999E-2,1.7500000000000002E-2,2.5000000000000001E-2,0.01]
[null,null,"Coupon Rate (3 month BBSW + margin)",null,3.075E-2,3.7249999999999998E-2,4.3749999999999997E-2,5.1250000000000004E-2,3.6249999999999998E-2]
[null,null,"Days in Coupon Period",null,90,90,90,90,90]
[null,null,"Coupon Entitlement to be paid out on the current Payment Date: 16 April 2014",null,330650.06,2248471.23,146712.32999999999,151643.84,260771.59]

{"sheet":"Cumulative Defaults","index":2,"n_rows":6,"n_cols":4,"rows_kept":6,"cut":false,"hidden":false,"merged":[]}
["Cumulative Defaults & Losses"]
[]
["Month","Gross Losses","Recoveries","Net Losses"]
["2013-09-01",{"$f":"'Collateral Tables'!M9/400000000","v":8.1764955000000002E-4},{"$f":"'Collateral Tables'!M23/400000000","v":1.1157090909091038E-6},{"$f":"B4-C4","v":8.1653384090909088E-4}]
["2013-12-01",{"$f":"'Collateral Tables'!I9/400000000","v":2.4623477500000001E-4},{"$f":"'Collateral Tables'!I23/400000000","v":2.3625E-4},{"$f":"B5-C5","v":9.9847750000000115E-6}]
["2014-03-01",{"$f":"'Collateral Tables'!E9/400000000","v":2.4684659000000003E-3},{"$f":"'Collateral Tables'!E23/400000000","v":4.7552124999999997E-5},{"$f":"B6-C6","v":2.4209137750000002E-3}]